Topics

Maven test keeps failing


Dan Boudreau
 

Trying to commit a simple change, Maven test failed 3 times in a row. PR Fix loading RFID bug #8988

 

 

[ERROR] Failures:

13121[ERROR] AutoActiveTrainsSMLStoppingTest.testShowAndClose:140 "Failed to slow entering south. begin - end - stop - stopping sensors." did not occur in time

13122[INFO]

13123[ERROR] Tests run: 27397, Failures: 1, Errors: 0, Skipped: 931

 

 

I need someone to fix this test or override it.

 

Dan

 

From: Daniel Boudreau
Sent: Thursday, September 3, 2020 8:09 AM
To: JMRI/JMRI
Cc: Ci activity
Subject: [JMRI/JMRI] PR run failed: Windows CI Tests - Fix loading RFID bug (4d2ff8f)

 

Run failed for master (4d2ff8f)

Repository: JMRI/JMRI
Workflow: Windows CI Tests
Duration: 32 minutes and 28.0 seconds
Finished: 2020-09-03 12:09:29 UTC

View results

Jobs:

  • build failed (2 annotations)


You are receiving this because this workflow ran on your branch.
Manage your GitHub Actions notifications here.